Target
Ribosomal protein S6 kinase alpha-6
Ligand
BDBM25118
Substrate
Meas. Tech.
ChEMBL_586360 (CHEMBL1061926)
Kd
>10000±n/a nM
Citation
 Karaman, MWHerrgard, STreiber, DKGallant, PAtteridge, CECampbell, BTChan, KWCiceri, PDavis, MIEdeen, PTFaraoni, RFloyd, MHunt, JPLockhart, DJMilanov, ZVMorrison, MJPallares, GPatel, HKPritchard, SWodicka, LMZarrinkar, PP A quantitative analysis of kinase inhibitor selectivity. Nat Biotechnol 26:127-32 (2008)  
Target
Name:
Ribosomal protein S6 kinase alpha-6
Synonyms:
90 kDa ribosomal protein S6 kinase 6 RPS6KA6 RPS6KA6(Kin.Dom.2 - C-terminal) RSK4 Ribosomal S6 kinase 4 Ribosomal protein S6 kinase alpha 6 (RSK4) S6K-alpha 6 p90RSK | pp90RSK4
Type:
Serine/threonine-protein kinase
Mol. Mass.:
83868.06
Organism:
Homo sapiens (Human)
Description:
Residue:
745
  
Inhibitor
Name:
BDBM25118
Synonyms:
(3Z)-4-amino-5-fluoro-3-[5-(4-methylpiperazino)-1,3-dihydrobenzimidazol-2-ylidene]carbostyril CHEMBL522892 | CHIR-258
Type:
Small organic molecule
Emp. Form.:
C21H21FN6O
Mol. Mass.:
392.4294
SMILES:
CN1CCN(CC1)c1ccc2nc([nH]c2c1)-c1c(N)c2c(F)cccc2[nH]c1=O
: