Target
Ribosomal protein S6 kinase alpha-4
Ligand
BDBM5447
Substrate
Meas. Tech.
ChEMBL_586491 (CHEMBL1051259)
Kd
>10000±n/a nM
Citation
 Karaman, MWHerrgard, STreiber, DKGallant, PAtteridge, CECampbell, BTChan, KWCiceri, PDavis, MIEdeen, PTFaraoni, RFloyd, MHunt, JPLockhart, DJMilanov, ZVMorrison, MJPallares, GPatel, HKPritchard, SWodicka, LMZarrinkar, PP A quantitative analysis of kinase inhibitor selectivity. Nat Biotechnol 26:127-32 (2008)  
Target
Name:
Ribosomal protein S6 kinase alpha-4
Synonyms:
90 kDa ribosomal protein S6 kinase 4 MSK2 Nuclear mitogen- and stress-activated protein kinase 2 RPS6KA4(Kin.Dom.1 - N-terminal) Ribosomal protein S6 kinase Ribosomal protein S6 kinase alpha-4 | Ribosomal protein kinase B
Type:
Serine/threonine-protein kinase
Mol. Mass.:
85620.38
Organism:
Homo sapiens (Human)
Description:
Recombinant MSK2 was phosphorylated by incubation with active p38alpha before assays.
Residue:
772
  
Inhibitor
Name:
BDBM5447
Synonyms:
CHEMBL939 Iressa N-(3-chloro-4-fluorophenyl)-7-methoxy-6-[3-(morpholin-4-yl)propoxy]quinazolin-4-amine US10507209, Compound Gefitinib US9730934, Gefitinib WO2022090481, Example gefitinib cid_123631
Type:
Small organic molecule
Emp. Form.:
C22H24ClFN4O3
Mol. Mass.:
446.902
SMILES:
COc1cc2ncnc(Nc3ccc(F)c(Cl)c3)c2cc1OCCCN1CCOCC1
: