Target
Mitogen-activated protein kinase 14
Ligand
BDBM50326053
Substrate
Meas. Tech.
ChEMBL_586347 (CHEMBL1061091)
Kd
>10000±n/a nM
Citation
 Karaman, MWHerrgard, STreiber, DKGallant, PAtteridge, CECampbell, BTChan, KWCiceri, PDavis, MIEdeen, PTFaraoni, RFloyd, MHunt, JPLockhart, DJMilanov, ZVMorrison, MJPallares, GPatel, HKPritchard, SWodicka, LMZarrinkar, PP A quantitative analysis of kinase inhibitor selectivity. Nat Biotechnol 26:127-32 (2008)  
Target
Name:
Mitogen-activated protein kinase 14
Synonyms:
CSAID-binding protein CSBP1 CSPB1 MAP kinase 14 MAP kinase p38 alpha MAPK14 MK14_HUMAN Mitogen-activated protein kinase p38 alpha Stress-activated protein kinase 2a | p38 MAP kinase alpha/beta
Type:
Serine/threonine-protein kinase
Mol. Mass.:
41286.76
Organism:
Homo sapiens (Human)
Description:
Q16539
Residue:
360
  
Inhibitor
Name:
BDBM50326053
Synonyms:
CHEMBL608533 | PKC-412
Type:
Small organic molecule
Emp. Form.:
C35H30N4O4
Mol. Mass.:
570.6371
SMILES:
CO[C@@H]1[C@@H](C[C@H]2O[C@]1(C)n1c3ccccc3c3c4CNC(=O)c4c4c5ccccc5n2c4c13)N(C)C(=O)c1ccccc1
: