Target
Phosphatidylinositol 5-phosphate 4-kinase type-2 beta
Ligand
BDBM50326053
Substrate
Meas. Tech.
ChEMBL_586994 (CHEMBL1062784)
Kd
270±n/a nM
Citation
 Karaman, MWHerrgard, STreiber, DKGallant, PAtteridge, CECampbell, BTChan, KWCiceri, PDavis, MIEdeen, PTFaraoni, RFloyd, MHunt, JPLockhart, DJMilanov, ZVMorrison, MJPallares, GPatel, HKPritchard, SWodicka, LMZarrinkar, PP A quantitative analysis of kinase inhibitor selectivity. Nat Biotechnol 26:127-32 (2008)  
Target
Name:
Phosphatidylinositol 5-phosphate 4-kinase type-2 beta
Synonyms:
PI42B_HUMAN PIP5K2B | Phosphatidylinositol-5-phosphate 4-kinase type-2 beta
Type:
PROTEIN
Mol. Mass.:
47382.97
Organism:
Homo sapiens (Human)
Description:
ChEMBL_774395
Residue:
416
  
Inhibitor
Name:
BDBM50326053
Synonyms:
CHEMBL608533 | PKC-412
Type:
Small organic molecule
Emp. Form.:
C35H30N4O4
Mol. Mass.:
570.6371
SMILES:
CO[C@@H]1[C@@H](C[C@H]2O[C@]1(C)n1c3ccccc3c3c4CNC(=O)c4c4c5ccccc5n2c4c13)N(C)C(=O)c1ccccc1
: