Target
Ribosomal protein S6 kinase alpha-2
Ligand
BDBM25118
Substrate
Meas. Tech.
ChEMBL_586996 (CHEMBL1062786)
Kd
>10000±n/a nM
Citation
 Karaman, MWHerrgard, STreiber, DKGallant, PAtteridge, CECampbell, BTChan, KWCiceri, PDavis, MIEdeen, PTFaraoni, RFloyd, MHunt, JPLockhart, DJMilanov, ZVMorrison, MJPallares, GPatel, HKPritchard, SWodicka, LMZarrinkar, PP A quantitative analysis of kinase inhibitor selectivity. Nat Biotechnol 26:127-32 (2008)  
Target
Name:
Ribosomal protein S6 kinase alpha-2
Synonyms:
90 kDa ribosomal protein S6 kinase 2 KS6A2_HUMAN MAPKAPK1C RPS6KA2(Kin.Dom.1 - N-terminal) Ribosomal S6 Kinase 3 (RSK-3) Ribosomal protein S6 kinase alpha 2 (RSK2) p90-RSK 2 pp90RSK3
Type:
Serine/threonine-protein kinase
Mol. Mass.:
83259.46
Organism:
Homo sapiens (Human)
Description:
Residue:
733
  
Inhibitor
Name:
BDBM25118
Synonyms:
(3Z)-4-amino-5-fluoro-3-[5-(4-methylpiperazino)-1,3-dihydrobenzimidazol-2-ylidene]carbostyril CHEMBL522892 | CHIR-258
Type:
Small organic molecule
Emp. Form.:
C21H21FN6O
Mol. Mass.:
392.4294
SMILES:
CN1CCN(CC1)c1ccc2nc([nH]c2c1)-c1c(N)c2c(F)cccc2[nH]c1=O
: