Target
3-phosphoinositide-dependent protein kinase 1
Ligand
BDBM13216
Substrate
Meas. Tech.
ChEMBL_586355 (CHEMBL1061922)
Kd
>10000±n/a nM
Citation
 Karaman, MWHerrgard, STreiber, DKGallant, PAtteridge, CECampbell, BTChan, KWCiceri, PDavis, MIEdeen, PTFaraoni, RFloyd, MHunt, JPLockhart, DJMilanov, ZVMorrison, MJPallares, GPatel, HKPritchard, SWodicka, LMZarrinkar, PP A quantitative analysis of kinase inhibitor selectivity. Nat Biotechnol 26:127-32 (2008)  
Target
Name:
3-phosphoinositide-dependent protein kinase 1
Synonyms:
3-Phosphoinositide-Dependent Protein Kinase 1 (PDK1) 3-phosphoinositide-dependent protein kinase 1 3-phosphoinositide-dependent protein kinase 1 (PDK-1) Isoform 2 of 3-phosphoinositide-dependent protein kinase 1 PDPK1 Phosphoinositide-dependent protein kinase 1 (PDK1) hPDK1
Type:
Enzyme
Mol. Mass.:
63157.65
Organism:
Homo sapiens (Human)
Description:
O15530
Residue:
556
  
Inhibitor
Name:
BDBM13216
Synonyms:
BMS-354825 DASATINIB N-(2-chloro-6-methylphenyl)-2-({6-[4-(2-hydroxyethyl)piperazin-1-yl]-2-methylpyrimidin-4-yl}amino)-1,3-thiazole-5-carboxamide US20230348453, Compound A8 med.21724, Compound Dasatinib
Type:
Small organic molecule
Emp. Form.:
C22H26ClN7O2S
Mol. Mass.:
488.006
SMILES:
Cc1nc(Nc2ncc(s2)C(=O)Nc2c(C)cccc2Cl)cc(n1)N1CCN(CCO)CC1
: