Target
Serine/threonine-protein kinase D1
Ligand
BDBM21
Substrate
Meas. Tech.
ChEMBL_587211 (CHEMBL1061155)
Kd
>10000±n/a nM
Citation
 Karaman, MWHerrgard, STreiber, DKGallant, PAtteridge, CECampbell, BTChan, KWCiceri, PDavis, MIEdeen, PTFaraoni, RFloyd, MHunt, JPLockhart, DJMilanov, ZVMorrison, MJPallares, GPatel, HKPritchard, SWodicka, LMZarrinkar, PP A quantitative analysis of kinase inhibitor selectivity. Nat Biotechnol 26:127-32 (2008)  
Target
Name:
Serine/threonine-protein kinase D1
Synonyms:
KPCD1_HUMAN PKD1 PRKD1 Protein kinase C mu type Protein kinase C, PKC; classical/novel Protein kinase D (PRKD1) nPKC-D1 | nPKC-mu
Type:
Serine/threonine-protein kinase
Mol. Mass.:
101705.07
Organism:
Homo sapiens (Human)
Description:
gi_115529463
Residue:
912
  
Inhibitor
Name:
BDBM21
Synonyms:
CHEMBL24828 VANDETANIB ZD6474 | cid_3081361
Type:
Emp. Form.:
C22H24BrFN4O2
Mol. Mass.:
475.354
SMILES:
COc1cc2c(Nc3ccc(Br)cc3F)ncnc2cc1OCC1CCN(C)CC1
: