Target
Cyclin-dependent kinase 14
Ligand
BDBM26300
Substrate
Meas. Tech.
ChEMBL_586855 (CHEMBL1051350)
Kd
>10000±n/a nM
Citation
 Karaman, MWHerrgard, STreiber, DKGallant, PAtteridge, CECampbell, BTChan, KWCiceri, PDavis, MIEdeen, PTFaraoni, RFloyd, MHunt, JPLockhart, DJMilanov, ZVMorrison, MJPallares, GPatel, HKPritchard, SWodicka, LMZarrinkar, PP A quantitative analysis of kinase inhibitor selectivity. Nat Biotechnol 26:127-32 (2008)  
Target
Name:
Cyclin-dependent kinase 14
Synonyms:
CDK14 KIAA0834 Serine/threonine-protein kinase PFTAIRE-1
Type:
PROTEIN
Mol. Mass.:
53075.39
Organism:
Homo sapiens (Human)
Description:
ChEMBL_774550
Residue:
469
  
Inhibitor
Name:
BDBM26300
Synonyms:
2-{3-[(7-{3-[ethyl(2-hydroxyethyl)amino]propoxy}quinazolin-4-yl)amino]-1H-pyrazol-5-yl}-N-(3-fluorophenyl)acetamide cid_16007391 | pyrazoloquinazoline deriv., 34
Type:
Small organic molecule
Emp. Form.:
C26H30FN7O3
Mol. Mass.:
507.5599
SMILES:
CCN(CCO)CCCOc1ccc2c(Nc3cc(CC(=O)Nc4cccc(F)c4)n[nH]3)ncnc2c1
: