Target
Cyclin-dependent kinase 14
Ligand
BDBM50110208
Substrate
Meas. Tech.
ChEMBL_586855 (CHEMBL1051350)
Kd
>10000±n/a nM
Citation
 Karaman, MWHerrgard, STreiber, DKGallant, PAtteridge, CECampbell, BTChan, KWCiceri, PDavis, MIEdeen, PTFaraoni, RFloyd, MHunt, JPLockhart, DJMilanov, ZVMorrison, MJPallares, GPatel, HKPritchard, SWodicka, LMZarrinkar, PP A quantitative analysis of kinase inhibitor selectivity. Nat Biotechnol 26:127-32 (2008)  
Target
Name:
Cyclin-dependent kinase 14
Synonyms:
CDK14 KIAA0834 Serine/threonine-protein kinase PFTAIRE-1
Type:
PROTEIN
Mol. Mass.:
53075.39
Organism:
Homo sapiens (Human)
Description:
ChEMBL_774550
Residue:
469
  
Inhibitor
Name:
BDBM50110208
Synonyms:
4-(4-(benzo[d][1,3]dioxol-5-yl)-5-(pyridin-2-yl)-1H-imidazol-2-yl)benzamide 4-(5-(benzo[d][1,3]dioxol-5-yl)-4-(pyridin-2-yl)-1H-imidazol-2-yl)benzamide CHEMBL440084 cid_4521392
Type:
Small organic molecule
Emp. Form.:
C22H16N4O3
Mol. Mass.:
384.3874
SMILES:
NC(=O)c1ccc(cc1)-c1nc(c([nH]1)-c1ccc2OCOc2c1)-c1ccccn1
: