Target
MAP/microtubule affinity-regulating kinase 4
Ligand
BDBM21
Substrate
Meas. Tech.
ChEMBL_587090 (CHEMBL1051302)
Kd
>10000±n/a nM
Citation
 Karaman, MWHerrgard, STreiber, DKGallant, PAtteridge, CECampbell, BTChan, KWCiceri, PDavis, MIEdeen, PTFaraoni, RFloyd, MHunt, JPLockhart, DJMilanov, ZVMorrison, MJPallares, GPatel, HKPritchard, SWodicka, LMZarrinkar, PP A quantitative analysis of kinase inhibitor selectivity. Nat Biotechnol 26:127-32 (2008)  
Target
Name:
MAP/microtubule affinity-regulating kinase 4
Synonyms:
KIAA1860 MARK4 MARKL1
Type:
PROTEIN
Mol. Mass.:
82561.08
Organism:
Homo sapiens (Human)
Description:
ChEMBL_774620
Residue:
752
  
Inhibitor
Name:
BDBM21
Synonyms:
CHEMBL24828 VANDETANIB ZD6474 | cid_3081361
Type:
Emp. Form.:
C22H24BrFN4O2
Mol. Mass.:
475.354
SMILES:
COc1cc2c(Nc3ccc(Br)cc3F)ncnc2cc1OCC1CCN(C)CC1
: