Target
Dual specificity mitogen-activated protein kinase kinase 4
Ligand
BDBM32362
Substrate
Meas. Tech.
ChEMBL_586988 (CHEMBL1062778)
Kd
>10000±n/a nM
Citation
 Karaman, MWHerrgard, STreiber, DKGallant, PAtteridge, CECampbell, BTChan, KWCiceri, PDavis, MIEdeen, PTFaraoni, RFloyd, MHunt, JPLockhart, DJMilanov, ZVMorrison, MJPallares, GPatel, HKPritchard, SWodicka, LMZarrinkar, PP A quantitative analysis of kinase inhibitor selectivity. Nat Biotechnol 26:127-32 (2008)  
Target
Name:
Dual specificity mitogen-activated protein kinase kinase 4
Synonyms:
JNK-activating kinase 1 JNKK1 MAP2K4 MKK4 PRKMK4 SEK1 SKK1 | c-Jun N-terminal kinase kinase 1
Type:
PROTEIN
Mol. Mass.:
44294.29
Organism:
Homo sapiens (Human)
Description:
ChEMBL_1460558
Residue:
399
  
Inhibitor
Name:
BDBM32362
Synonyms:
5-[[3-methoxy-4-[(4-methoxyphenyl)methoxy]phenyl]methyl]pyrimidine-2,4-diamine [2-amino-5-(3-methoxy-4-p-anisyloxy-benzyl)pyrimidin-4-yl]amine | cid_11617559
Type:
Small organic molecule
Emp. Form.:
C20H22N4O3
Mol. Mass.:
366.4137
SMILES:
COc1ccc(COc2ccc(Cc3cnc(N)nc3N)cc2OC)cc1
: