Target
Serine/threonine-protein kinase D3
Ligand
BDBM13530
Substrate
Meas. Tech.
ChEMBL_586720 (CHEMBL1062866)
Kd
>10000±n/a nM
Citation
 Karaman, MWHerrgard, STreiber, DKGallant, PAtteridge, CECampbell, BTChan, KWCiceri, PDavis, MIEdeen, PTFaraoni, RFloyd, MHunt, JPLockhart, DJMilanov, ZVMorrison, MJPallares, GPatel, HKPritchard, SWodicka, LMZarrinkar, PP A quantitative analysis of kinase inhibitor selectivity. Nat Biotechnol 26:127-32 (2008)  
Target
Name:
Serine/threonine-protein kinase D3
Synonyms:
EPK2 PRKCN Protein kinase C nu Protein kinase C, PKC Protein kinase EPK2 classical/novel | nPKC-nu
Type:
Enzyme Catalytic Domain
Mol. Mass.:
100475.64
Organism:
Homo sapiens (Human)
Description:
gi_5031689
Residue:
890
  
Inhibitor
Name:
BDBM13530
Synonyms:
4-[(4-methylpiperazin-1-yl)methyl]-N-[4-methyl-3-[(4-pyridin-3-ylpyrimidin-2-yl)amino]phenyl]benzamide Gleevec Imatinib, 21 STI-571 US10906896, Cpd imatinib US11725005, Compound imatinib cid_5291 med.21724, Compound 6
Type:
Small organic molecule
Emp. Form.:
C29H31N7O
Mol. Mass.:
493.6027
SMILES:
CN1CCN(Cc2ccc(cc2)C(=O)Nc2ccc(C)c(Nc3nccc(n3)-c3cccnc3)c2)CC1
: