Target
MAP/microtubule affinity-regulating kinase 3
Ligand
BDBM21079
Substrate
Meas. Tech.
ChEMBL_586825 (CHEMBL1063802)
Kd
>10000±n/a nM
Citation
 Karaman, MWHerrgard, STreiber, DKGallant, PAtteridge, CECampbell, BTChan, KWCiceri, PDavis, MIEdeen, PTFaraoni, RFloyd, MHunt, JPLockhart, DJMilanov, ZVMorrison, MJPallares, GPatel, HKPritchard, SWodicka, LMZarrinkar, PP A quantitative analysis of kinase inhibitor selectivity. Nat Biotechnol 26:127-32 (2008)  
Target
Name:
MAP/microtubule affinity-regulating kinase 3
Synonyms:
2.7.11.1 CTAK1 ELKL motif kinase 2 EMK2 MAP/microtubule affinity-regulating kinase 3 (MARK 3) MARK3_HUMAN Protein kinase STK10 Serine/threonine-protein kinase c-TAK1 | Serine/threonine-protein kinase p78
Type:
Protein
Mol. Mass.:
84525.94
Organism:
Homo sapiens (Human)
Description:
P27448
Residue:
753
  
Inhibitor
Name:
BDBM21079
Synonyms:
1-[4-(3-amino-1H-indazol-4-yl)phenyl]-3-(2-fluoro-5-methyl-phenyl)urea 1-[4-(3-azanyl-1H-indazol-4-yl)phenyl]-3-(2-fluoranyl-5-methyl-phenyl)urea ABT-869 CHEMBL223360 | cid_11485656
Type:
Small organic molecule
Emp. Form.:
C21H18FN5O
Mol. Mass.:
375.3989
SMILES:
Cc1ccc(F)c(NC(=O)Nc2ccc(cc2)-c2cccc3[nH]nc(N)c23)c1
: