Target
Ribosomal protein S6 kinase alpha-6
Ligand
BDBM5446
Substrate
Meas. Tech.
ChEMBL_586360 (CHEMBL1061926)
Kd
>10000±n/a nM
Citation
 Karaman, MWHerrgard, STreiber, DKGallant, PAtteridge, CECampbell, BTChan, KWCiceri, PDavis, MIEdeen, PTFaraoni, RFloyd, MHunt, JPLockhart, DJMilanov, ZVMorrison, MJPallares, GPatel, HKPritchard, SWodicka, LMZarrinkar, PP A quantitative analysis of kinase inhibitor selectivity. Nat Biotechnol 26:127-32 (2008)  
Target
Name:
Ribosomal protein S6 kinase alpha-6
Synonyms:
90 kDa ribosomal protein S6 kinase 6 RPS6KA6 RPS6KA6(Kin.Dom.2 - C-terminal) RSK4 Ribosomal S6 kinase 4 Ribosomal protein S6 kinase alpha 6 (RSK4) S6K-alpha 6 p90RSK | pp90RSK4
Type:
Serine/threonine-protein kinase
Mol. Mass.:
83868.06
Organism:
Homo sapiens (Human)
Description:
Residue:
745
  
Inhibitor
Name:
BDBM5446
Synonyms:
CHEMBL553 Erlotinib N-(3-Ethynylphenyl)-6,7-bis(2-methoxyethoxy)-4-quinazolinamine Monohydrochloride OSI-774 US10189853, erlotinib US11524945, Compound Erlotinib US9730934, Erlotinib cid_176870
Type:
Small organic molecule
Emp. Form.:
C22H23N3O4
Mol. Mass.:
393.4357
SMILES:
COCCOc1cc2ncnc(Nc3cccc(c3)C#C)c2cc1OCCOC
: