Target
Dual specificity protein kinase CLK3
Ligand
BDBM24773
Substrate
Meas. Tech.
ChEMBL_587177 (CHEMBL1060240)
Kd
>10000±n/a nM
Citation
 Karaman, MWHerrgard, STreiber, DKGallant, PAtteridge, CECampbell, BTChan, KWCiceri, PDavis, MIEdeen, PTFaraoni, RFloyd, MHunt, JPLockhart, DJMilanov, ZVMorrison, MJPallares, GPatel, HKPritchard, SWodicka, LMZarrinkar, PP A quantitative analysis of kinase inhibitor selectivity. Nat Biotechnol 26:127-32 (2008)  
Target
Name:
Dual specificity protein kinase CLK3
Synonyms:
CDC2-like kinase 3 (CLK3) CLK3_HUMAN | Dual specificity protein kinase CLK3
Type:
Protein
Mol. Mass.:
73570.11
Organism:
Homo sapiens (Human)
Description:
Residue:
638
  
Inhibitor
Name:
BDBM24773
Synonyms:
AMG 706 Motesanib N-(3,3-dimethyl-1,2-dihydroindol-6-yl)-2-(pyridin-4-ylmethylamino)pyridine-3-carboxamide N-(3,3-dimethylindolin-6-yl)-2-(4-pyridylmethylamino)nicotinamide cid_11667893
Type:
Small organic molecule
Emp. Form.:
C22H23N5O
Mol. Mass.:
373.4509
SMILES:
CC1(C)CNc2cc(NC(=O)c3cccnc3NCc3ccncc3)ccc12
: