Target
Calcium/calmodulin-dependent protein kinase type II subunit gamma
Ligand
BDBM4814
Substrate
Meas. Tech.
ChEMBL_586950 (CHEMBL1061137)
Kd
690±n/a nM
Citation
 Karaman, MWHerrgard, STreiber, DKGallant, PAtteridge, CECampbell, BTChan, KWCiceri, PDavis, MIEdeen, PTFaraoni, RFloyd, MHunt, JPLockhart, DJMilanov, ZVMorrison, MJPallares, GPatel, HKPritchard, SWodicka, LMZarrinkar, PP A quantitative analysis of kinase inhibitor selectivity. Nat Biotechnol 26:127-32 (2008)  
Target
Name:
Calcium/calmodulin-dependent protein kinase type II subunit gamma
Synonyms:
2.7.11.17 CAMK-II CAMKG CaM kinase II gamma CaMK-II subunit gamma Calcium/calmodulin-dependent protein kinase type II subunit gamma (CAMKllg) | KCC2G_HUMAN
Type:
Protein
Mol. Mass.:
62621.56
Organism:
Homo sapiens (Human)
Description:
Q13555
Residue:
558
  
Inhibitor
Name:
BDBM4814
Synonyms:
CHEMBL535 N-[2-(diethylamino)ethyl]-5-{[(3Z)-5-fluoro-2-oxo-2,3-dihydro-1H-indol-3-ylidene]methyl}-2,4-dimethyl-1H-pyrrole-3-carboxamide SUNITINIB US10464902, Sunitinib US9914707, SU11248
Type:
Small organic molecule
Emp. Form.:
C22H27FN4O2
Mol. Mass.:
398.4738
SMILES:
CCN(CC)CCNC(=O)c1c(C)[nH]c(\C=C2/C(=O)Nc3ccc(F)cc23)c1C
: