Target
Casein kinase I isoform gamma-1
Ligand
BDBM25118
Substrate
Meas. Tech.
ChEMBL_586563 (CHEMBL1060186)
Kd
>10000±n/a nM
Citation
 Karaman, MWHerrgard, STreiber, DKGallant, PAtteridge, CECampbell, BTChan, KWCiceri, PDavis, MIEdeen, PTFaraoni, RFloyd, MHunt, JPLockhart, DJMilanov, ZVMorrison, MJPallares, GPatel, HKPritchard, SWodicka, LMZarrinkar, PP A quantitative analysis of kinase inhibitor selectivity. Nat Biotechnol 26:127-32 (2008)  
Target
Name:
Casein kinase I isoform gamma-1
Synonyms:
CKI-gamma 1 Casein kinase I Casein kinase I isoform gamma-1 | KC1G1_HUMAN
Type:
PROTEIN
Mol. Mass.:
48530.93
Organism:
Homo sapiens (Human)
Description:
ChEMBL_774608
Residue:
422
  
Inhibitor
Name:
BDBM25118
Synonyms:
(3Z)-4-amino-5-fluoro-3-[5-(4-methylpiperazino)-1,3-dihydrobenzimidazol-2-ylidene]carbostyril CHEMBL522892 | CHIR-258
Type:
Small organic molecule
Emp. Form.:
C21H21FN6O
Mol. Mass.:
392.4294
SMILES:
CN1CCN(CC1)c1ccc2nc([nH]c2c1)-c1c(N)c2c(F)cccc2[nH]c1=O
: