Target
Serine/threonine-protein kinase MRCK alpha
Ligand
BDBM13531
Substrate
Meas. Tech.
ChEMBL_587190 (CHEMBL1060251)
Kd
>10000±n/a nM
Citation
 Karaman, MWHerrgard, STreiber, DKGallant, PAtteridge, CECampbell, BTChan, KWCiceri, PDavis, MIEdeen, PTFaraoni, RFloyd, MHunt, JPLockhart, DJMilanov, ZVMorrison, MJPallares, GPatel, HKPritchard, SWodicka, LMZarrinkar, PP A quantitative analysis of kinase inhibitor selectivity. Nat Biotechnol 26:127-32 (2008)  
Target
Name:
Serine/threonine-protein kinase MRCK alpha
Synonyms:
CDC42BPA MRCK alpha MRCKA_HUMAN Serine/threonine-protein kinase MRCK alpha | Serine/threonine-protein kinase MRCK-A
Type:
Protien
Mol. Mass.:
197305.74
Organism:
Homo sapiens (Human)
Description:
Q5VT25
Residue:
1732
  
Inhibitor
Name:
BDBM13531
Synonyms:
4-(4-Fluorophenyl)-2-(4-hydroxyphenyl)-5-(4-pyridyl)-1H-imidazole 4-[4-(4-fluorophenyl)-5-(4-pyridyl)-4-imidazolin-2-ylidene]cyclohexa-2,5-dien-1-one SB-202190 biotinylated SB202190
Type:
Small organic molecule
Emp. Form.:
C20H14FN3O
Mol. Mass.:
331.3431
SMILES:
Oc1ccc(cc1)-c1nc(c([nH]1)-c1ccc(F)cc1)-c1ccncc1
: