Target
Activin receptor type-2A
Ligand
BDBM31093
Substrate
Meas. Tech.
ChEMBL_587170 (CHEMBL1060234)
Kd
>10000±n/a nM
Citation
 Karaman, MWHerrgard, STreiber, DKGallant, PAtteridge, CECampbell, BTChan, KWCiceri, PDavis, MIEdeen, PTFaraoni, RFloyd, MHunt, JPLockhart, DJMilanov, ZVMorrison, MJPallares, GPatel, HKPritchard, SWodicka, LMZarrinkar, PP A quantitative analysis of kinase inhibitor selectivity. Nat Biotechnol 26:127-32 (2008)  
Target
Name:
Activin receptor type-2A
Synonyms:
ACVR2 AVR2A_HUMAN | Activin receptor type-2A
Type:
Enzyme Catalytic Domain
Mol. Mass.:
57840.94
Organism:
Homo sapiens (Human)
Description:
gi_4501897
Residue:
513
  
Inhibitor
Name:
BDBM31093
Synonyms:
4-[[7-[2,6-bis(fluoranyl)phenyl]-9-chloranyl-5H-pyrimido[5,4-d][2]benzazepin-2-yl]amino]benzoic acid BDBM31832 MLN-8054 | cid_11712649
Type:
Small organic molecule
Emp. Form.:
C25H15ClF2N4O2
Mol. Mass.:
476.862
SMILES:
OC(=O)c1ccc(Nc2ncc3CN=C(c4cc(Cl)ccc4-c3n2)c2c(F)cccc2F)cc1
: