Target
Ephrin type-B receptor 2
Ligand
BDBM4851
Substrate
Meas. Tech.
ChEMBL_586454 (CHEMBL1063709)
Kd
>10000±n/a nM
Citation
 Karaman, MWHerrgard, STreiber, DKGallant, PAtteridge, CECampbell, BTChan, KWCiceri, PDavis, MIEdeen, PTFaraoni, RFloyd, MHunt, JPLockhart, DJMilanov, ZVMorrison, MJPallares, GPatel, HKPritchard, SWodicka, LMZarrinkar, PP A quantitative analysis of kinase inhibitor selectivity. Nat Biotechnol 26:127-32 (2008)  
Target
Name:
Ephrin type-B receptor 2
Synonyms:
DRT ELK-related tyrosine kinase EPH-like kinase 5 EPHB2_HUMAN EPTH3 Ephrin receptor TYRO5
Type:
PROTEIN
Mol. Mass.:
117491.44
Organism:
Homo sapiens (Human)
Description:
ChEMBL_1476221
Residue:
1055
  
Inhibitor
Name:
BDBM4851
Synonyms:
(4-chlorophenyl)-[4-(4-pyridylmethyl)phthalazin-1-yl]amine CGP 79787 CHEMBL75232 N-(4-chlorophenyl)-4-(pyridin-4-ylmethyl)phthalazin-1-amine PTK787 cid_151194
Type:
Small organic molecule
Emp. Form.:
C20H15ClN4
Mol. Mass.:
346.813
SMILES:
Clc1ccc(Nc2nnc(Cc3ccncc3)c3ccccc23)cc1
: