Target
Tyrosine-protein kinase ABL1
Ligand
BDBM4851
Substrate
Meas. Tech.
ChEMBL_586942 (CHEMBL1061130)
Kd
>10000±n/a nM
Citation
 Karaman, MWHerrgard, STreiber, DKGallant, PAtteridge, CECampbell, BTChan, KWCiceri, PDavis, MIEdeen, PTFaraoni, RFloyd, MHunt, JPLockhart, DJMilanov, ZVMorrison, MJPallares, GPatel, HKPritchard, SWodicka, LMZarrinkar, PP A quantitative analysis of kinase inhibitor selectivity. Nat Biotechnol 26:127-32 (2008)  
Target
Name:
Tyrosine-protein kinase ABL1
Synonyms:
ABL ABL1_HUMAN JTK7 Proto-oncogene tyrosine-protein kinase ABL1 Tyrosine-protein kinase ABL V-abl Abelson murine leukemia viral oncogene homolog 1 p150 | tyrosine-protein kinase ABL1 isoform a
Type:
Enzyme
Mol. Mass.:
122897.30
Organism:
Homo sapiens (Human)
Description:
P00519
Residue:
1130
  
Inhibitor
Name:
BDBM4851
Synonyms:
(4-chlorophenyl)-[4-(4-pyridylmethyl)phthalazin-1-yl]amine CGP 79787 CHEMBL75232 N-(4-chlorophenyl)-4-(pyridin-4-ylmethyl)phthalazin-1-amine PTK787 cid_151194
Type:
Small organic molecule
Emp. Form.:
C20H15ClN4
Mol. Mass.:
346.813
SMILES:
Clc1ccc(Nc2nnc(Cc3ccncc3)c3ccccc23)cc1
: