Target
Atypical kinase COQ8B, mitochondrial
Ligand
BDBM32362
Substrate
Meas. Tech.
ChEMBL_586944 (CHEMBL1061132)
Kd
>10000±n/a nM
Citation
 Karaman, MWHerrgard, STreiber, DKGallant, PAtteridge, CECampbell, BTChan, KWCiceri, PDavis, MIEdeen, PTFaraoni, RFloyd, MHunt, JPLockhart, DJMilanov, ZVMorrison, MJPallares, GPatel, HKPritchard, SWodicka, LMZarrinkar, PP A quantitative analysis of kinase inhibitor selectivity. Nat Biotechnol 26:127-32 (2008)  
Target
Name:
Atypical kinase COQ8B, mitochondrial
Synonyms:
ADCK4 COQ8B_HUMAN | Uncharacterized aarF domain-containing protein kinase 4
Type:
PROTEIN
Mol. Mass.:
60073.32
Organism:
Homo sapiens (Human)
Description:
ChEMBL_586944
Residue:
544
  
Inhibitor
Name:
BDBM32362
Synonyms:
5-[[3-methoxy-4-[(4-methoxyphenyl)methoxy]phenyl]methyl]pyrimidine-2,4-diamine [2-amino-5-(3-methoxy-4-p-anisyloxy-benzyl)pyrimidin-4-yl]amine | cid_11617559
Type:
Small organic molecule
Emp. Form.:
C20H22N4O3
Mol. Mass.:
366.4137
SMILES:
COc1ccc(COc2ccc(Cc3cnc(N)nc3N)cc2OC)cc1
: