Target
Carbonic anhydrase
Ligand
BDBM10864
Substrate
Meas. Tech.
ChEMBL_587743 (CHEMBL1038579)
Ki
104±n/a nM
Citation
 Bertucci, AInnocenti, AZoccola, DScozzafava, ATambutté, SSupuran, CT Carbonic anhydrase inhibitors. Inhibition studies of a coral secretory isoform by sulfonamides. Bioorg Med Chem 17:5054-8 (2009)  
Target
Name:
Carbonic anhydrase
Synonyms:
Alpha carbonic anhydrase
Type:
PROTEIN
Mol. Mass.:
36650.57
Organism:
Stylophora pistillata
Description:
ChEMBL_700658
Residue:
323
  
Inhibitor
Name:
BDBM10864
Synonyms:
4-Amino-3-bromobenzenesulfonamide CHEMBL6724 halogenosulfanilamide deriv. 5d
Type:
Small organic molecule
Emp. Form.:
C6H7BrN2O2S
Mol. Mass.:
251.101
SMILES:
Nc1ccc(cc1Br)S(N)(=O)=O
: