Target
Cannabinoid receptor 2
Ligand
BDBM50298929
Substrate
Meas. Tech.
ChEMBL_588142 (CHEMBL1049259)
Ki
>3940±n/a nM
Citation
 Silvestri, RLigresti, ALa Regina, GPiscitelli, FGatti, VBrizzi, APasquini, SLavecchia, AAllarà, MFantini, NCarai, MANovellino, EColombo, GDi Marzo, VCorelli, F Synthesis, cannabinoid receptor affinity, molecular modeling studies and in vivo pharmacological evaluation of new substituted 1-aryl-5-(1H-pyrrol-1-yl)-1H-pyrazole-3-carboxamides. 2. Effect of the 3-carboxamide substituent on the affinity and selectivity profile. Bioorg Med Chem 17:5549-64 (2009)  
Target
Name:
Cannabinoid receptor 2
Synonyms:
CANNABINOID CB2 CB2 CB2B CNR2_HUMAN Cannabinoid CB2 receptor Cannabinoid receptor 2 (CB2R) | hCB2
Type:
G Protein-Coupled Receptor (GPCR)
Mol. Mass.:
39690.94
Organism:
Homo sapiens (Human)
Description:
P34972
Residue:
360
  
Inhibitor
Name:
BDBM50298929
Synonyms:
CHEMBL575401 | N-[2-(4-Chlorophenyl)ethyl]1-(2,4-difluorophenyl)-4-methyl-5-(1H-pyrrol-1-yl)-1H-pyrazole-3-carboxamide
Type:
Small organic molecule
Emp. Form.:
C23H19ClF2N4O
Mol. Mass.:
440.873
SMILES:
Cc1c(nn(c1-n1cccc1)-c1ccc(F)cc1F)C(=O)NCCc1ccc(Cl)cc1
: