Target
Carbonic anhydrase 2
Ligand
BDBM50299573
Substrate
Meas. Tech.
ChEMBL_592385 (CHEMBL1036958)
Ki
4500±n/a nM
Citation
 Lopez, MPaul, BHofmann, AMorizzi, JWu, QKCharman, SAInnocenti, AVullo, DSupuran, CTPoulsen, SA S-glycosyl primary sulfonamides--a new structural class for selective inhibition of cancer-associated carbonic anhydrases. J Med Chem 52:6421-32 (2009)  
Target
Name:
Carbonic anhydrase 2
Synonyms:
CA-II CAC Carbonate dehydratase II Carbonic anhydrase 2 (CA-II) Carbonic anhydrase C Carbonic anhydrase II (CA-II) Carbonic anhydrase II (hCA II) | Carbonic anhydrase isoenzyme II (hCA II)
Type:
Enzyme
Mol. Mass.:
29250.71
Organism:
Homo sapiens (Human)
Description:
P00918
Residue:
260
  
Inhibitor
Name:
BDBM50299573
Synonyms:
(2R,3R,4S,5R,6S)-2-(acetoxymethyl)-6-sulfamoyltetrahydro-2H-pyran-3,4,5-triyl triacetate | CHEMBL568705
Type:
Small organic molecule
Emp. Form.:
C14H21NO11S
Mol. Mass.:
411.382
SMILES:
CC(=O)OC[C@H]1O[C@H]([C@H](OC(C)=O)[C@@H](OC(C)=O)[C@@H]1OC(C)=O)S(N)(=O)=O
: