Target
Carbonic anhydrase 9
Ligand
BDBM50299573
Substrate
Meas. Tech.
ChEMBL_592386 (CHEMBL1036959)
Ki
3910±n/a nM
Citation
 Lopez, MPaul, BHofmann, AMorizzi, JWu, QKCharman, SAInnocenti, AVullo, DSupuran, CTPoulsen, SA S-glycosyl primary sulfonamides--a new structural class for selective inhibition of cancer-associated carbonic anhydrases. J Med Chem 52:6421-32 (2009)  
Target
Name:
Carbonic anhydrase 9
Synonyms:
CA-IX CAH9_HUMAN Carbonic anhydrase 9 (CA IX) Carbonic anhydrase 9 precursor Carbonic anhydrase IX (CAIX) Carbonic anhydrases; II & IX MN RCC-associated antigen G250
Type:
Enzyme
Mol. Mass.:
49669.03
Organism:
Homo sapiens (Human)
Description:
Catalytic domain of human cloned isozyme was used in the assay
Residue:
459
  
Inhibitor
Name:
BDBM50299573
Synonyms:
(2R,3R,4S,5R,6S)-2-(acetoxymethyl)-6-sulfamoyltetrahydro-2H-pyran-3,4,5-triyl triacetate | CHEMBL568705
Type:
Small organic molecule
Emp. Form.:
C14H21NO11S
Mol. Mass.:
411.382
SMILES:
CC(=O)OC[C@H]1O[C@H]([C@H](OC(C)=O)[C@@H](OC(C)=O)[C@@H]1OC(C)=O)S(N)(=O)=O
: