Target
Carbonic anhydrase 2
Ligand
BDBM10888
Substrate
Meas. Tech.
ChEMBL_588928 (CHEMBL1063843)
Ki
876±n/a nM
Citation
 Carta, FMaresca, ACovarrubias, ASMowbray, SLJones, TASupuran, CT Carbonic anhydrase inhibitors. Characterization and inhibition studies of the most active beta-carbonic anhydrase from Mycobacterium tuberculosis, Rv3588c. Bioorg Med Chem Lett 19:6649-54 (2009)  
Target
Name:
Carbonic anhydrase 2
Synonyms:
β-Carbonic anhydrase 2 (CA 2) MTCA2_MYCTU cynT | mtcA2
Type:
Enzyme
Mol. Mass.:
21788.97
Organism:
Mycobacterium tuberculosis
Description:
P9WPJ9
Residue:
207
  
Inhibitor
Name:
BDBM10888
Synonyms:
1,2-benzoxazol-3-ylmethanesulfonamide SPR_2 Zonisamide Zonisamide (ZNS) Zonisamide, ZNS
Type:
Small organic molecule
Emp. Form.:
C8H8N2O3S
Mol. Mass.:
212.226
SMILES:
NS(=O)(=O)Cc1noc2ccccc12
: