Target
Disintegrin and metalloproteinase domain-containing protein 10
Ligand
BDBM50301106
Substrate
Meas. Tech.
ChEMBL_598554 (CHEMBL1043546)
IC50
12±n/a nM
Citation
 Li, YLShi, EBurns, DLi, YCovington, MBPan, MScherle, PFriedman, SMetcalf, BYao, W Discovery of novel selective HER-2 sheddase inhibitors through optimization of P1 moiety. Bioorg Med Chem Lett 19:5037-42 (2009)  
Target
Name:
Disintegrin and metalloproteinase domain-containing protein 10
Synonyms:
ADA10_HUMAN Disintegrin and metalloproteinase domain-containing protein 10 (ADAM10) MADM
Type:
Enzyme
Mol. Mass.:
84160.93
Organism:
Homo sapiens (Human)
Description:
O14672
Residue:
748
  
Inhibitor
Name:
BDBM50301106
Synonyms:
(2S,3S)-N-hydroxy-5-(N-methylbenzamido)-2-(4-phenyl-1,2,3,6-tetrahydropyridine-1-carbonyl)piperidine-3-carboxamide | CHEMBL570760
Type:
Small organic molecule
Emp. Form.:
C26H30N4O4
Mol. Mass.:
462.5408
SMILES:
CN(C1CN[C@@H]([C@H](C1)C(=O)NO)C(=O)N1CCC(=CC1)c1ccccc1)C(=O)c1ccccc1
: