Target
Melanocortin receptor 4
Ligand
BDBM50121900
Substrate
Meas. Tech.
ChEMBL_598565 (CHEMBL1043557)
EC50
0.14±n/a nM
Citation
 Ruwe, ARKoikov, LAbdel-Malek, ZHaskell-Luevano, CDirain, MLPortillo, FXiang, ZWortman, MKnittel, JJ Semi-rigid tripeptide agonists of melanocortin receptors. Bioorg Med Chem Lett 19:5176-81 (2009)  
Target
Name:
Melanocortin receptor 4
Synonyms:
MC4-R Mc4r
Type:
PROTEIN
Mol. Mass.:
36964.43
Organism:
Mus musculus
Description:
ChEMBL_1498850
Residue:
332
  
Inhibitor
Name:
BDBM50121900
Synonyms:
Ac-Ser-Try-Ser-Nle-Glu-His-DPhe-Arg-Trp-Gly-Lys-Pro-Val-NH2 | CHEMBL439490
Type:
Small organic molecule
Emp. Form.:
C78H111N21O19
Mol. Mass.:
1646.8452
SMILES:
CCCC[C@H](NC(=O)C(CO)NC(=O)[C@H](Cc1ccc(O)cc1)NC(=O)[C@H](CO)NC(C)=O)C(=O)N[C@@H](CCC(O)=O)C(=O)N[C@@H](Cc1cnc[nH]1)C(=O)N[C@H](Cc1ccccc1)C(=O)N[C@@H](CCCNC(N)=N)C(=O)N[C@@H](Cc1c[nH]c2ccccc12)C(=O)NCC(=O)N[C@@H](CCCCN)C(=O)N1CCC[C@@H]1C(=O)N[C@H](C(C)C)C(N)=O
: