Target
Tyrosine-protein kinase JAK2
Ligand
BDBM50303065
Substrate
Meas. Tech.
ChEMBL_597289 (CHEMBL1044320)
IC50
1500±n/a nM
Citation
 Ledeboer, MWPierce, ACDuffy, JPGao, HMessersmith, DSalituro, FGNanthakumar, SCome, JZuccola, HJSwenson, LShlyakter, DMahajan, SHoock, TFan, BTsai, WJKolaczkowski, ECarrier, SHogan, JKZessis, RPazhanisamy, SBennani, YL 2-Aminopyrazolo[1,5-a]pyrimidines as potent and selective inhibitors of JAK2. Bioorg Med Chem Lett 19:6529-33 (2009)  
Target
Name:
Tyrosine-protein kinase JAK2
Synonyms:
JAK-2 JAK2_HUMAN Janus kinase 2 (JAK2) | Janus kinase 2 (a protein tyrosine kinase)
Type:
Protein
Mol. Mass.:
130684.68
Organism:
Homo sapiens (Human)
Description:
O60674
Residue:
1132
  
Inhibitor
Name:
BDBM50303065
Synonyms:
3-(6-(4-chlorobenzylamino)pyrimidin-4-yl)pyrazolo[1,5-a]pyrimidin-2-amine | CHEMBL569012
Type:
Small organic molecule
Emp. Form.:
C17H14ClN7
Mol. Mass.:
351.793
SMILES:
Nc1nn2cccnc2c1-c1cc(NCc2ccc(Cl)cc2)ncn1
: