Target
Carbonic anhydrase 15
Ligand
BDBM50303495
Substrate
Meas. Tech.
ChEMBL_595961 (CHEMBL1044463)
Ki
6600±n/a nM
Citation
 Maresca, ATemperini, CPochet, LMasereel, BScozzafava, ASupuran, CT Deciphering the mechanism of carbonic anhydrase inhibition with coumarins and thiocoumarins. J Med Chem 53:335-44 (2010)  
Target
Name:
Carbonic anhydrase 15
Synonyms:
CAH15_MOUSE Car15
Type:
PROTEIN
Mol. Mass.:
35484.02
Organism:
Mus musculus
Description:
ChEMBL_651955
Residue:
324
  
Inhibitor
Name:
BDBM50303495
Synonyms:
CHEMBL568385 | ethyl 7-methoxy-2-oxo-2H-chromene-3-carboxylate
Type:
Small organic molecule
Emp. Form.:
C13H12O5
Mol. Mass.:
248.2314
SMILES:
CCOC(=O)c1cc2ccc(OC)cc2oc1=O
: