Target
NAD-dependent protein deacetylase sirtuin-2
Ligand
BDBM4814
Substrate
Meas. Tech.
ChEMBL_597552 (CHEMBL1047027)
IC50
122700±n/a nM
Citation
 Huber, KSchemies, JUciechowska, UWagner, JMRumpf, TLewrick, FSüss, RSippl, WJung, MBracher, F Novel 3-arylideneindolin-2-ones as inhibitors of NAD+ -dependent histone deacetylases (sirtuins). J Med Chem 53:1383-6 (2010)  
Target
Name:
NAD-dependent protein deacetylase sirtuin-2
Synonyms:
NAD-Dependent Deacetylase Sirtuin-2 NAD-dependent deacetylase sirtuin 3 SIR2-like SIR2L SIR2_HUMAN Sirtuin 2 (SIRT2)
Type:
Hydrolase
Mol. Mass.:
43172.62
Organism:
Homo sapiens (Human)
Description:
Residue:
389
  
Inhibitor
Name:
BDBM4814
Synonyms:
CHEMBL535 N-[2-(diethylamino)ethyl]-5-{[(3Z)-5-fluoro-2-oxo-2,3-dihydro-1H-indol-3-ylidene]methyl}-2,4-dimethyl-1H-pyrrole-3-carboxamide SUNITINIB US10464902, Sunitinib US9914707, SU11248
Type:
Small organic molecule
Emp. Form.:
C22H27FN4O2
Mol. Mass.:
398.4738
SMILES:
CCN(CC)CCNC(=O)c1c(C)[nH]c(\C=C2/C(=O)Nc3ccc(F)cc23)c1C
: