Target
Indoleamine 2,3-dioxygenase 1
Ligand
BDBM50303903
Substrate
Meas. Tech.
ChEMBL_595173 (CHEMBL1040015)
IC50
30000±n/a nM
Citation
 Röhrig, UFAwad, LGrosdidier, ALarrieu, PStroobant, VColau, DCerundolo, VSimpson, AJVogel, PVan den Eynde, BJZoete, VMichielin, O Rational design of indoleamine 2,3-dioxygenase inhibitors. J Med Chem 53:1172-89 (2010)  
Target
Name:
Indoleamine 2,3-dioxygenase 1
Synonyms:
I23O1_MOUSE Ido Indo | Indoleamine-pyrrole 2,3-dioxygenase
Type:
PROTEIN
Mol. Mass.:
45639.39
Organism:
Mus musculus
Description:
ChEMBL_1452149
Residue:
407
  
Inhibitor
Name:
BDBM50303903
Synonyms:
4-(Isopropylamino)-1-naphthol | CHEMBL578212
Type:
Small organic molecule
Emp. Form.:
C13H15NO
Mol. Mass.:
201.2643
SMILES:
CC(C)Nc1ccc(O)c2ccccc12
: