Target
Type-1 angiotensin II receptor A
Ligand
BDBM50303981
Substrate
Meas. Tech.
ChEMBL_595237 (CHEMBL1043589)
Ki
>10000±n/a nM
Citation
 Mizuno, CSChittiboyina, AGShah, FHPatny, AKurtz, TWPershadsingh, HASpeth, RCKaramyan, VTCarvalho, PBAvery, MA Design, synthesis, and docking studies of novel benzimidazoles for the treatment of metabolic syndrome. J Med Chem 53:1076-85 (2010)  
Target
Name:
Type-1 angiotensin II receptor A
Synonyms:
AGTRA_RAT Agtr1 Angiotensin II AT1 Angiotensin II receptor (AT-1) type-1 Type-1A angiotensin II receptor
Type:
Enzyme Catalytic Domain
Mol. Mass.:
40910.53
Organism:
RAT
Description:
ANGIOTENSIN AT1 AGTR1 RAT::P25095
Residue:
359
  
Inhibitor
Name:
BDBM50303981
Synonyms:
CHEMBL567063 | Ethyl 3-(4-((4-Methyl-2-propyl-1H-benzo[d]imidazol-1-yl)methyl)-phenyl)acrylate
Type:
Small organic molecule
Emp. Form.:
C23H26N2O2
Mol. Mass.:
362.4647
SMILES:
CCCc1nc2c(C)cccc2n1Cc1ccc(\C=C\C(=O)OCC)cc1
: