Target
Receptor-type tyrosine-protein kinase FLT3
Ligand
BDBM4810
Substrate
Meas. Tech.
ChEMBL_610308 (CHEMBL1071420)
IC50
160±n/a nM
Citation
 Mologni, LRostagno, RBrussolo, SKnowles, PPKjaer, SMurray-Rust, JRosso, EZambon, AScapozza, LMcDonald, NQLucchini, VGambacorti-Passerini, C Synthesis, structure-activity relationship and crystallographic studies of 3-substituted indolin-2-one RET inhibitors. Bioorg Med Chem 18:1482-96 (2010)  
Target
Name:
Receptor-type tyrosine-protein kinase FLT3
Synonyms:
CD135 FL cytokine receptor FLK2 FLT3 Fetal liver kinase-2 Fms-like tyrosine kinase 3 (Flt-3) STK-1 Stem cell tyrosine kinase 1
Type:
Enzyme
Mol. Mass.:
112888.62
Organism:
Homo sapiens (Human)
Description:
P36888
Residue:
993
  
Inhibitor
Name:
BDBM4810
Synonyms:
(3Z)-3-[(3,5-dimethyl-1H-pyrrol-2-yl)methylidene]-2,3-dihydro-1H-indol-2-one CHEMBL276711 SU5416 US10189853, semaxanib US9422297, SU5416 | cid_5329098
Type:
Small organic molecule
Emp. Form.:
C15H14N2O
Mol. Mass.:
238.2845
SMILES:
Cc1cc(C)c(\C=C2/C(=O)Nc3ccccc23)[nH]1
: