Target
ALK tyrosine kinase receptor
Ligand
BDBM50307129
Substrate
Meas. Tech.
ChEMBL_610306 (CHEMBL1071418)
IC50
>50000±n/a nM
Citation
 Mologni, LRostagno, RBrussolo, SKnowles, PPKjaer, SMurray-Rust, JRosso, EZambon, AScapozza, LMcDonald, NQLucchini, VGambacorti-Passerini, C Synthesis, structure-activity relationship and crystallographic studies of 3-substituted indolin-2-one RET inhibitors. Bioorg Med Chem 18:1482-96 (2010)  
Target
Name:
ALK tyrosine kinase receptor
Synonyms:
ALK ALK_HUMAN CD_antigen: CD246
Type:
Protein
Mol. Mass.:
176453.10
Organism:
Homo sapiens (Human)
Description:
Q9UM73
Residue:
1620
  
Inhibitor
Name:
BDBM50307129
Synonyms:
3-((4-(dimethylamino)naphthalen-1-yl)methylene)-4-methylindolin-2-one | CHEMBL597960
Type:
Small organic molecule
Emp. Form.:
C22H20N2O
Mol. Mass.:
328.407
SMILES:
CN(C)c1ccc(\C=C2/C(=O)Nc3cccc(C)c23)c2ccccc12
: