Target
Proto-oncogene tyrosine-protein kinase receptor Ret
Ligand
BDBM50307135
Substrate
Meas. Tech.
ChEMBL_610305 (CHEMBL1071417)
IC50
63000±n/a nM
Citation
 Mologni, LRostagno, RBrussolo, SKnowles, PPKjaer, SMurray-Rust, JRosso, EZambon, AScapozza, LMcDonald, NQLucchini, VGambacorti-Passerini, C Synthesis, structure-activity relationship and crystallographic studies of 3-substituted indolin-2-one RET inhibitors. Bioorg Med Chem 18:1482-96 (2010)  
Target
Name:
Proto-oncogene tyrosine-protein kinase receptor Ret
Synonyms:
CDHF12 Cadherin family member 12 Proto-oncogene c-Ret RET51 Tyrosine-protein kinase Ret (RET)
Type:
Protein
Mol. Mass.:
124318.29
Organism:
Homo sapiens (Human)
Description:
P07949
Residue:
1114
  
Inhibitor
Name:
BDBM50307135
Synonyms:
(E)-5-Amino-3-(4-methoxybenzylidene)indolin-2-one | CHEMBL608424
Type:
Small organic molecule
Emp. Form.:
C16H14N2O2
Mol. Mass.:
266.2946
SMILES:
COc1ccc(\C=C2\C(=O)Nc3ccc(N)cc23)cc1
: