Target
Proto-oncogene tyrosine-protein kinase receptor Ret
Ligand
BDBM50307140
Substrate
Meas. Tech.
ChEMBL_610305 (CHEMBL1071417)
IC50
580±n/a nM
Citation
 Mologni, LRostagno, RBrussolo, SKnowles, PPKjaer, SMurray-Rust, JRosso, EZambon, AScapozza, LMcDonald, NQLucchini, VGambacorti-Passerini, C Synthesis, structure-activity relationship and crystallographic studies of 3-substituted indolin-2-one RET inhibitors. Bioorg Med Chem 18:1482-96 (2010)  
Target
Name:
Proto-oncogene tyrosine-protein kinase receptor Ret
Synonyms:
CDHF12 Cadherin family member 12 Proto-oncogene c-Ret RET51 Tyrosine-protein kinase Ret (RET)
Type:
Protein
Mol. Mass.:
124318.29
Organism:
Homo sapiens (Human)
Description:
P07949
Residue:
1114
  
Inhibitor
Name:
BDBM50307140
Synonyms:
(Z)-3-(3,5-Dimethyl-1H-pyrrol-2-ylmethylene)-5-pyridin-3-yl-1,3-dihydro-indol-2-one | CHEMBL602074
Type:
Small organic molecule
Emp. Form.:
C20H17N3O
Mol. Mass.:
315.3685
SMILES:
Cc1cc(C)c(\C=C2/C(=O)Nc3ccc(cc23)-c2cccnc2)[nH]1
: