Target
Proto-oncogene tyrosine-protein kinase receptor Ret
Ligand
BDBM50307146
Substrate
Meas. Tech.
ChEMBL_610305 (CHEMBL1071417)
IC50
1400±n/a nM
Citation
 Mologni, LRostagno, RBrussolo, SKnowles, PPKjaer, SMurray-Rust, JRosso, EZambon, AScapozza, LMcDonald, NQLucchini, VGambacorti-Passerini, C Synthesis, structure-activity relationship and crystallographic studies of 3-substituted indolin-2-one RET inhibitors. Bioorg Med Chem 18:1482-96 (2010)  
Target
Name:
Proto-oncogene tyrosine-protein kinase receptor Ret
Synonyms:
CDHF12 Cadherin family member 12 Proto-oncogene c-Ret RET51 Tyrosine-protein kinase Ret (RET)
Type:
Protein
Mol. Mass.:
124318.29
Organism:
Homo sapiens (Human)
Description:
P07949
Residue:
1114
  
Inhibitor
Name:
BDBM50307146
Synonyms:
(Z)-5-Bromo-3-(3,5-dimethyl-1H-pyrrol-2-ylmethylene)-1,3-dihydro-indol-2-one | CHEMBL599807
Type:
Small organic molecule
Emp. Form.:
C15H13BrN2O
Mol. Mass.:
317.181
SMILES:
Cc1cc(C)c(\C=C2/C(=O)Nc3ccc(Br)cc23)[nH]1
: