Target
Amine oxidase [flavin-containing] B
Ligand
BDBM50307366
Substrate
Meas. Tech.
ChEMBL_610656 (CHEMBL1071676)
Ki
980±n/a nM
Citation
 Lühr, SVilches-Herrera, MFierro, ARamsay, RREdmondson, DEReyes-Parada, MCassels, BKIturriaga-Vásquez, P 2-Arylthiomorpholine derivatives as potent and selective monoamine oxidase B inhibitors. Bioorg Med Chem 18:1388-95 (2010)  
Target
Name:
Amine oxidase [flavin-containing] B
Synonyms:
AOFB_RAT Amine oxidase [flavin-containing] B Monoamine Oxidase Type B (MAO-B) Monoamine oxidase B (MAO-B) Monoamine oxidase type B (MAOB) | Monoamine oxidase-B (MAO-B)
Type:
Enzyme
Mol. Mass.:
58469.65
Organism:
Rattus norvegicus (rat)
Description:
P19643
Residue:
520
  
Inhibitor
Name:
BDBM50307366
Synonyms:
(+/-)-2-(4'-Propoxyphenyl)thiomorpholine | CHEMBL608141
Type:
Small organic molecule
Emp. Form.:
C13H19NOS
Mol. Mass.:
237.361
SMILES:
CCCOc1ccc(cc1)C1CNCCS1
: