Target
5'-nucleotidase
Ligand
BDBM50268685
Substrate
Meas. Tech.
ChEMBL_612633 (CHEMBL1065670)
Ki
6530±n/a nM
Citation
 Baqi, YLee, SYIqbal, JRipphausen, PLehr, AScheiff, ABZimmermann, HBajorath, JMüller, CE Development of potent and selective inhibitors of ecto-5'-nucleotidase based on an anthraquinone scaffold. J Med Chem 53:2076-86 (2010)  
Target
Name:
5'-nucleotidase
Synonyms:
5'-nucleotidase Ecto-5'-nucleotidase (e5'NT) NT Nt5e | Nte
Type:
Enzyme
Mol. Mass.:
63971.44
Organism:
Rattus norvegicus (Rat)
Description:
P21588
Residue:
576
  
Inhibitor
Name:
BDBM50268685
Synonyms:
CHEMBL524064 | sodium 1-amino-4-(2-carboxyphenylamino)-9,10-dioxo-9,10-dihydroanthracene-2-sulfonate
Type:
Small organic molecule
Emp. Form.:
C21H13N2O7S
Mol. Mass.:
437.403
SMILES:
Nc1c(cc(Nc2ccccc2C(O)=O)c2C(=O)c3ccccc3C(=O)c12)S([O-])(=O)=O
: