Target
Cell division cycle 7-related protein kinase
Ligand
BDBM50307987
Substrate
Meas. Tech.
ChEMBL_608398 (CHEMBL1074432)
IC50
>10000±n/a nM
Citation
 Brasca, MGAlbanese, CAlzani, RAmici, RAvanzi, NBallinari, DBischoff, JBorghi, DCasale, ECroci, VFiorentini, FIsacchi, AMercurio, CNesi, MOrsini, PPastori, WPesenti, EPevarello, PRoussel, PVarasi, MVolpi, DVulpetti, ACiomei, M Optimization of 6,6-dimethyl pyrrolo[3,4-c]pyrazoles: Identification of PHA-793887, a potent CDK inhibitor suitable for intravenous dosing. Bioorg Med Chem 18:1844-53 (2010)  
Target
Name:
Cell division cycle 7-related protein kinase
Synonyms:
CDC7 CDC7L1 Cell division cycle 7-related protein kinase (CDC7) huCdc7
Type:
Protein
Mol. Mass.:
63908.16
Organism:
Homo sapiens (Human)
Description:
O00311
Residue:
574
  
Inhibitor
Name:
BDBM50307987
Synonyms:
CHEMBL604712 | N-[5-(2,2-Dimethylpropanoyl)-6,6-dimethyl-1,4,5,6-tetrahydropyrrolo[3,4-c]pyrazol-3-yl]-3,5-difluorobenzamide
Type:
Small organic molecule
Emp. Form.:
C19H22F2N4O2
Mol. Mass.:
376.4004
SMILES:
CC(C)(C)C(=O)N1Cc2c(NC(=O)c3cc(F)cc(F)c3)[nH]nc2C1(C)C
: