Target
D(2) dopamine receptor
Ligand
BDBM50001955
Substrate
Meas. Tech.
ChEMBL_609690 (CHEMBL1066831)
Ki
244±n/a nM
Citation
 Pettersson, FPontén, HWaters, NWaters, SSonesson, C Synthesis and evaluation of a set of 4-phenylpiperidines and 4-phenylpiperazines as D2 receptor ligands and the discovery of the dopaminergic stabilizer 4-[3-(methylsulfonyl)phenyl]-1-propylpiperidine (huntexil, pridopidine, ACR16). J Med Chem 53:2510-20 (2010)  
Target
Name:
D(2) dopamine receptor
Synonyms:
D(2) dopamine receptor DOPAMINE D2 Long DRD2 Dopamine D2 receptor Dopamine D2 receptor (D2R) Dopamine2-like | d2
Type:
Cell-surface receptors
Mol. Mass.:
50647.10
Organism:
Homo sapiens (Human)
Description:
P14416
Residue:
443
  
Inhibitor
Name:
BDBM50001955
Synonyms:
(-)6-Methyl-5,6,6a,7-tetrahydro-4H-dibenzo[de,g]quinoline-10,11-diol(APO) (R)-6-Methyl-5,6,6a,7-tetrahydro-4H-dibenzo[de,g]quinoline-10,11-diol ((R)-apomorphine) (R)-6-Methyl-5,6,6a,7-tetrahydro-4H-dibenzo[de,g]quinoline-10,11-diol(apomorphine) 6-Methyl-5,6,6a,7-tetrahydro-4H-dibenzo[de,g]quinoline-10,11-diol 6-Methyl-5,6,6a,7-tetrahydro-4H-dibenzo[de,g]quinoline-10,11-diol((R)-apomorphine) APOMORPHINE APOMORPHINE6-Methyl-5,6,6a,7-tetrahydro-4H-dibenzo[de,g]quinoline-10,11-diol | CHEMBL53
Type:
Small organic molecule
Emp. Form.:
C17H17NO2
Mol. Mass.:
267.3224
SMILES:
CN1CCc2cccc-3c2[C@H]1Cc1ccc(O)c(O)c-31
: