Target
Alpha-glucosidase MAL12
Ligand
BDBM50308258
Substrate
Meas. Tech.
ChEMBL_613790 (CHEMBL1069561)
IC50
5700±n/a nM
Citation
 Ferreira, SBSodero, ACCardoso, MFLima, ESKaiser, CRSilva, FPFerreira, VF Synthesis, biological activity, and molecular modeling studies of 1H-1,2,3-triazole derivatives of carbohydrates as alpha-glucosidases inhibitors. J Med Chem 53:2364-75 (2010)  
Target
Name:
Alpha-glucosidase MAL12
Synonyms:
α-Glucosidase MAL12_YEAST Maltase | alpha-Glucosidase (α-Glucosidase)
Type:
Protein
Mol. Mass.:
68084.32
Organism:
Saccharomyces cerevisiae
Description:
P53341
Residue:
584
  
Inhibitor
Name:
BDBM50308258
Synonyms:
1-O-Methyl-2,3-O-isopropylidene-5-(4-phenoxymethyl-1H-1,2,3-triazol-1-yl)-beta-D-ribofuranose | CHEMBL597996
Type:
Small organic molecule
Emp. Form.:
C18H23N3O5
Mol. Mass.:
361.3923
SMILES:
CO[C@@H]1O[C@H](Cn2cc(COc3ccccc3)nn2)[C@H]2OC(C)(C)O[C@@H]12
: