Target
Carbonic anhydrase 12
Ligand
BDBM4374
Substrate
Meas. Tech.
ChEMBL_613337 (CHEMBL1074274)
Ki
8010±n/a nM
Citation
 Innocenti, ABeyza Oztürk Sarikaya, SGülçin, ISupuran, CT Carbonic anhydrase inhibitors. Inhibition of mammalian isoforms I-XIV with a series of natural product polyphenols and phenolic acids. Bioorg Med Chem 18:2159-64 (2010)  
Target
Name:
Carbonic anhydrase 12
Synonyms:
CA-XII CAH12_HUMAN Carbonic anhydrase Carbonic anhydrase XII Carbonic anhydrase XII (CAXII) | Tumor antigen HOM-RCC-3.1.3
Type:
Enzyme
Mol. Mass.:
39456.00
Organism:
Homo sapiens (Human)
Description:
Catalytic domain of human cloned isozyme was used in the assay
Residue:
354
  
Inhibitor
Name:
BDBM4374
Synonyms:
(2E)-3-(4-hydroxyphenyl)prop-2-enoic acid CHEMBL66879 p-Hydroxycinnamic acid (p-HCA) p-hydroxycinnamic acid (M4)
Type:
Small organic molecule
Emp. Form.:
C9H8O3
Mol. Mass.:
164.158
SMILES:
OC(=O)\C=C\c1ccc(O)cc1
: