Target
Adenosine receptor A2a
Ligand
BDBM50308495
Substrate
Meas. Tech.
ChEMBL_613345 (CHEMBL1074282)
Ki
>1000±n/a nM
Citation
 Scheiff, ABYerande, SGEl-Tayeb, ALi, WInamdar, GSVasu, KKSudarsanam, VMüller, CE 2-Amino-5-benzoyl-4-phenylthiazoles: Development of potent and selective adenosine A1 receptor antagonists. Bioorg Med Chem 18:2195-203 (2010)  
Target
Name:
Adenosine receptor A2a
Synonyms:
AA2AR_RAT Adenosine A2 receptor Adenosine Receptors A2a (A2a) Adenosine receptors A2a Rat striatal adenosine A2a receptor
Type:
G Protein-Coupled Receptor (GPCR)
Mol. Mass.:
45015.65
Organism:
Rattus norvegicus (rat)
Description:
Rat A2A receptors expressed in CHO cells.
Residue:
410
  
Inhibitor
Name:
BDBM50308495
Synonyms:
(4-(Methylsulfonyl)phenyl)(4-phenyl-2-(phenylamino)-thiazol-5-yl)methanone | CHEMBL602717
Type:
Small organic molecule
Emp. Form.:
C23H18N2O3S2
Mol. Mass.:
434.531
SMILES:
CS(=O)(=O)c1ccc(cc1)C(=O)c1sc(Nc2ccccc2)nc1-c1ccccc1
: