Target
Adenosine receptor A2a
Ligand
BDBM50308501
Substrate
Meas. Tech.
ChEMBL_613345 (CHEMBL1074282)
Ki
1640±n/a nM
Citation
 Scheiff, ABYerande, SGEl-Tayeb, ALi, WInamdar, GSVasu, KKSudarsanam, VMüller, CE 2-Amino-5-benzoyl-4-phenylthiazoles: Development of potent and selective adenosine A1 receptor antagonists. Bioorg Med Chem 18:2195-203 (2010)  
Target
Name:
Adenosine receptor A2a
Synonyms:
AA2AR_RAT Adenosine A2 receptor Adenosine Receptors A2a (A2a) Adenosine receptors A2a Rat striatal adenosine A2a receptor
Type:
G Protein-Coupled Receptor (GPCR)
Mol. Mass.:
45015.65
Organism:
Rattus norvegicus (rat)
Description:
Rat A2A receptors expressed in CHO cells.
Residue:
410
  
Inhibitor
Name:
BDBM50308501
Synonyms:
CHEMBL603129 cid_7315331
Type:
Small organic molecule
Emp. Form.:
C19H16N2O3S
Mol. Mass.:
352.407
SMILES:
CCOC(=O)Nc1nc(c(s1)C(=O)c1ccccc1)-c1ccccc1
: