Target
Adenosine receptor A1
Ligand
BDBM50308504
Substrate
Meas. Tech.
ChEMBL_613342 (CHEMBL1074279)
Ki
>1000±n/a nM
Citation
 Scheiff, ABYerande, SGEl-Tayeb, ALi, WInamdar, GSVasu, KKSudarsanam, VMüller, CE 2-Amino-5-benzoyl-4-phenylthiazoles: Development of potent and selective adenosine A1 receptor antagonists. Bioorg Med Chem 18:2195-203 (2010)  
Target
Name:
Adenosine receptor A1
Synonyms:
AA1R_RAT ADENOSINE A1 high Adenosine A1 receptor (A1) Adenosine receptors A1 | Adora1
Type:
Protein
Mol. Mass.:
36704.13
Organism:
Rattus norvegicus (rat)
Description:
Residue:
326
  
Inhibitor
Name:
BDBM50308504
Synonyms:
(2-(Methylamino)-4-phenylthiazol-5-yl)(phenyl)methanone | CHEMBL602519
Type:
Small organic molecule
Emp. Form.:
C17H14N2OS
Mol. Mass.:
294.371
SMILES:
CNc1nc(c(s1)C(=O)c1ccccc1)-c1ccccc1
: