Target
Adenosine receptor A1
Ligand
BDBM50266051
Substrate
Meas. Tech.
ChEMBL_613344 (CHEMBL1074281)
Ki
>6700±n/a nM
Citation
 Scheiff, ABYerande, SGEl-Tayeb, ALi, WInamdar, GSVasu, KKSudarsanam, VMüller, CE 2-Amino-5-benzoyl-4-phenylthiazoles: Development of potent and selective adenosine A1 receptor antagonists. Bioorg Med Chem 18:2195-203 (2010)  
Target
Name:
Adenosine receptor A1
Synonyms:
A1 adenosine receptor (hA1) AA1R_HUMAN ADORA1 Adenosine A1-receptor Adenosine receptor A1 (hA1) | Adenosine transporter (AdT)
Type:
G Protein-Coupled Receptor (GPCR)
Mol. Mass.:
36520.92
Organism:
Homo sapiens (Human)
Description:
P30542
Residue:
326
  
Inhibitor
Name:
BDBM50266051
Synonyms:
(4-(furan-2-yl)-2-(2-(thiophen-2-yl)ethylamino)thiazol-5-yl)(phenyl)methanone | CHEMBL457102
Type:
Small organic molecule
Emp. Form.:
C20H16N2O2S2
Mol. Mass.:
380.483
SMILES:
O=C(c1sc(NCCc2cccs2)nc1-c1ccco1)c1ccccc1
: