Target
Adenosine receptor A3
Ligand
BDBM50308505
Substrate
Meas. Tech.
ChEMBL_613362 (CHEMBL1064296)
Ki
0.400000±n/a nM
Citation
 Scheiff, ABYerande, SGEl-Tayeb, ALi, WInamdar, GSVasu, KKSudarsanam, VMüller, CE 2-Amino-5-benzoyl-4-phenylthiazoles: Development of potent and selective adenosine A1 receptor antagonists. Bioorg Med Chem 18:2195-203 (2010)  
Target
Name:
Adenosine receptor A3
Synonyms:
A3 adenosine receptor (hA3) ADORA3 | Adenosine A3 receptor (A3AR)
Type:
G Protein-Coupled Receptor (GPCR)
Mol. Mass.:
36197.32
Organism:
Homo sapiens (Human)
Description:
P0DMS8
Residue:
318
  
Inhibitor
Name:
BDBM50308505
Synonyms:
CHEMBL589080 | N-[5-pyridin-4-yl-4-(3,4,5-trimethoxyphenyl)thiazol-2-yl]acetamide
Type:
Small organic molecule
Emp. Form.:
C19H19N3O4S
Mol. Mass.:
385.437
SMILES:
COc1cc(cc(OC)c1OC)-c1nc(NC(C)=O)sc1-c1ccncc1
: